{"text_format":"1","workbook":"xlsx","n_sheets":4,"sheets":["Turma","Relatório","dadosPercentis2","tblMLS2"],"not_rendered":{"charts":0,"images":4,"macros":1,"external_links":0,"defined_names":3,"comments":1,"pivot_tables":0},"unopened":[],"bounds":{"document_bytes":16777216,"sheet_cells":100000,"rows_first":2000,"rows_last":500,"rows_between":2000,"halvings":0,"cell_chars":16384,"cell_head_chars":4096},"cells_cut":0,"cells_raw":0,"read":"whole","date_system":"1900"}

{"sheet":"Turma","index":0,"n_rows":53,"n_cols":8,"rows_kept":53,"cut":false,"hidden":false,"merged":[]}
[null,"Ano:",null,null,null,"Média Global:",{"$f":"IF(COUNTA(G4:G53)>0,AVERAGE(G4:G53),\"\")","v":""}]
[{"$f":"COUNTIF(B4:B53,\"x\")","v":0},"Turma:",null,null,null,"Desvio Padrão Global:",{"$f":"IF(COUNTA(G4:G53)>0,_xlfn.STDEV.P(G4:G53),\"\")","v":""}]
["ID Aluno",{"$f":"_xlfn.CONCAT(\"Ver: \",A2)","v":"Ver: 0"},"Nome","Género","Data de nascimento","Data de avaliação","Altura","Idade"]
[1,null,null,null,null,null,null,{"$f":"IF(AND(E4<>\"\",F4<>\"\"),INT(12*_xlfn.DAYS(F4,E4)/365),\"\")","v":""}]
[{"$f":"A4+1","v":2},null,null,null,null,null,null,{"$f":"IF(AND(E5<>\"\",F5<>\"\"),INT(12*_xlfn.DAYS(F5,E5)/365),\"\")","v":""}]
[{"$f":"A5+1","v":3},null,null,null,null,null,null,""]
[4,null,null,null,null,null,null,""]
[5,null,null,null,null,null,null,""]
[6,null,null,null,null,null,null,""]
[7,null,null,null,null,null,null,""]
[8,null,null,null,null,null,null,""]
[9,null,null,null,null,null,null,""]
[10,null,null,null,null,null,null,""]
[11,null,null,null,null,null,null,""]
[12,null,null,null,null,null,null,""]
[13,null,null,null,null,null,null,""]
[14,null,null,null,null,null,null,""]
[15,null,null,null,null,null,null,""]
[16,null,null,null,null,null,null,""]
[17,null,null,null,null,null,null,""]
{"$rows_left_out":34}
{"sheet":"Relatório","index":1,"n_rows":50,"n_cols":11,"rows_kept":50,"cut":false,"hidden":false,"merged":[[12,0,12,9],[14,0,14,6],[31,0,31,5]]}
["RELATÓRIO INDIVIDUAL - ALTURA"]
[{"$f":"IF(Turma!A2=1,VLOOKUP(\"x\",Turma!B$4:G$53,2,0),\"\")","v":""}]
[{"$f":"IF(Turma!A2=1,_xlfn.CONCAT(TEXT(VLOOKUP(\"x\",Turma!B$4:G$53,4,0),\"dd-mm-aaaa\"),\" | \",Turma!C1,\"º ano\",\" | \",Turma!C2),\"\")","v":""}]
[]
[null,"Resultado",null,"Média",null,"Mínimo",null,"Máximo"]
[null,"da criança",null,"da turma",null,"da turma",null,"da turma"]
["Altura (cm)",{"$f":"IF(Turma!$A$2=1,VLOOKUP(\"x\",Turma!B4:J53,6,0),0)","v":0},null,{"$f":"IF(Turma!$A$2=1,Turma!G1,0)","v":0},null,{"$f":"IF(Turma!$A$2=1,SMALL(Turma!G4:G53,1),0)","v":0},null,{"$f":"IF(Turma!$A$2=1,LARGE(Turma!G4:G53,1),0)","v":0}]
[]
[]
[]
[]
[]
["Cartas de Referência da altura do concelho de Matosinhos"]
[]
[]
[]
[]
[]
[]
[]
{"$rows_left_out":31}
{"sheet":"dadosPercentis2","index":2,"n_rows":170,"n_cols":13,"rows_kept":170,"cut":false,"hidden":true,"merged":[]}
["meses","anos","P3","P10","P25","P50","P75","P90","P97",null,"Género","Meses","Altura"]
[60,{"$f":"IF(A2/12=INT(A2/12),A2/12,\"\")","v":5},null,null,null,null,null,null,null,null,{"$f":"IF(Turma!A2=1,VLOOKUP(\"x\",Turma!B4:G53,3,0),\"\")","v":""},{"$f":"IF(Turma!A2=1,VLOOKUP(\"x\",Turma!B4:H53,7,0),\"\")","v":""},{"$f":"IF(Turma!A2=1,VLOOKUP(\"x\",Turma!B4:H53,6,0),\"\")","v":""}]
[61,{"$f":"IF(A3/12=INT(A3/12),A3/12,\"\")","v":""},{"$f":"IF(Turma!A$2=1,IF(VLOOKUP(\"x\",Turma!$B$4:$G$53,3,0)=\"Menina\",tblMLS2!K2,tblMLS2!K170),\"\")","v":""},{"$f":"IF(Turma!A$2=1,IF(VLOOKUP(\"x\",Turma!$B$4:$G$53,3,0)=\"Menina\",tblMLS2!M2,tblMLS2!M170),\"\")","v":""},{"$f":"IF(Turma!A$2=1,IF(VLOOKUP(\"x\",Turma!$B$4:$G$53,3,0)=\"Menina\",tblMLS2!O2,tblMLS2!O170),\"\")","v":""},{"$f":"IF(Turma!A$2=1,IF(VLOOKUP(\"x\",Turma!$B$4:$G$53,3,0)=\"Menina\",tblMLS2!P2,tblMLS2!P170),\"\")","v":""},{"$f":"IF(Turma!A$2=1,IF(VLOOKUP(\"x\",Turma!$B$4:$G$53,3,0)=\"Menina\",tblMLS2!Q2,tblMLS2!Q170),\"\")","v":""},{"$f":"IF(Turma!A$2=1,IF(VLOOKUP(\"x\",Turma!$B$4:$G$53,3,0)=\"Menina\",tblMLS2!S2,tblMLS2!S170),\"\")","v":""},{"$f":"IF(Turma!A$2=1,IF(VLOOKUP(\"x\",Turma!$B$4:$G$53,3,0)=\"Menina\",tblMLS2!U2,tblMLS2!U170),\"\")","v":""}]
[62,"",{"$f":"IF(Turma!A$2=1,IF(VLOOKUP(\"x\",Turma!$B$4:$G$53,3,0)=\"Menina\",tblMLS2!K3,tblMLS2!K171),\"\")","v":""},{"$f":"IF(Turma!A$2=1,IF(VLOOKUP(\"x\",Turma!$B$4:$G$53,3,0)=\"Menina\",tblMLS2!M3,tblMLS2!M171),\"\")","v":""},{"$f":"IF(Turma!A$2=1,IF(VLOOKUP(\"x\",Turma!$B$4:$G$53,3,0)=\"Menina\",tblMLS2!O3,tblMLS2!O171),\"\")","v":""},{"$f":"IF(Turma!A$2=1,IF(VLOOKUP(\"x\",Turma!$B$4:$G$53,3,0)=\"Menina\",tblMLS2!P3,tblMLS2!P171),\"\")","v":""},{"$f":"IF(Turma!A$2=1,IF(VLOOKUP(\"x\",Turma!$B$4:$G$53,3,0)=\"Menina\",tblMLS2!Q3,tblMLS2!Q171),\"\")","v":""},{"$f":"IF(Turma!A$2=1,IF(VLOOKUP(\"x\",Turma!$B$4:$G$53,3,0)=\"Menina\",tblMLS2!S3,tblMLS2!S171),\"\")","v":""},{"$f":"IF(Turma!A$2=1,IF(VLOOKUP(\"x\",Turma!$B$4:$G$53,3,0)=\"Menina\",tblMLS2!U3,tblMLS2!U171),\"\")","v":""}]
[63,"",{"$f":"IF(Turma!A$2=1,IF(VLOOKUP(\"x\",Turma!$B$4:$G$53,3,0)=\"Menina\",tblMLS2!K4,tblMLS2!K172),\"\")","v":""},{"$f":"IF(Turma!A$2=1,IF(VLOOKUP(\"x\",Turma!$B$4:$G$53,3,0)=\"Menina\",tblMLS2!M4,tblMLS2!M172),\"\")","v":""},{"$f":"IF(Turma!A$2=1,IF(VLOOKUP(\"x\",Turma!$B$4:$G$53,3,0)=\"Menina\",tblMLS2!O4,tblMLS2!O172),\"\")","v":""},{"$f":"IF(Turma!A$2=1,IF(VLOOKUP(\"x\",Turma!$B$4:$G$53,3,0)=\"Menina\",tblMLS2!P4,tblMLS2!P172),\"\")","v":""},{"$f":"IF(Turma!A$2=1,IF(VLOOKUP(\"x\",Turma!$B$4:$G$53,3,0)=\"Menina\",tblMLS2!Q4,tblMLS2!Q172),\"\")","v":""},{"$f":"IF(Turma!A$2=1,IF(VLOOKUP(\"x\",Turma!$B$4:$G$53,3,0)=\"Menina\",tblMLS2!S4,tblMLS2!S172),\"\")","v":""},{"$f":"IF(Turma!A$2=1,IF(VLOOKUP(\"x\",Turma!$B$4:$G$53,3,0)=\"Menina\",tblMLS2!U4,tblMLS2!U172),\"\")","v":""}]
[64,"",{"$f":"IF(Turma!A$2=1,IF(VLOOKUP(\"x\",Turma!$B$4:$G$53,3,0)=\"Menina\",tblMLS2!K5,tblMLS2!K173),\"\")","v":""},{"$f":"IF(Turma!A$2=1,IF(VLOOKUP(\"x\",Turma!$B$4:$G$53,3,0)=\"Menina\",tblMLS2!M5,tblMLS2!M173),\"\")","v":""},{"$f":"IF(Turma!A$2=1,IF(VLOOKUP(\"x\",Turma!$B$4:$G$53,3,0)=\"Menina\",tblMLS2!O5,tblMLS2!O173),\"\")","v":""},{"$f":"IF(Turma!A$2=1,IF(VLOOKUP(\"x\",Turma!$B$4:$G$53,3,0)=\"Menina\",tblMLS2!P5,tblMLS2!P173),\"\")","v":""},{"$f":"IF(Turma!A$2=1,IF(VLOOKUP(\"x\",Turma!$B$4:$G$53,3,0)=\"Menina\",tblMLS2!Q5,tblMLS2!Q173),\"\")","v":""},{"$f":"IF(Turma!A$2=1,IF(VLOOKUP(\"x\",Turma!$B$4:$G$53,3,0)=\"Menina\",tblMLS2!S5,tblMLS2!S173),\"\")","v":""},{"$f":"IF(Turma!A$2=1,IF(VLOOKUP(\"x\",Turma!$B$4:$G$53,3,0)=\"Menina\",tblMLS2!U5,tblMLS2!U173),\"\")","v":""}]
[65,"",{"$f":"IF(Turma!A$2=1,IF(VLOOKUP(\"x\",Turma!$B$4:$G$53,3,0)=\"Menina\",tblMLS2!K6,tblMLS2!K174),\"\")","v":""},{"$f":"IF(Turma!A$2=1,IF(VLOOKUP(\"x\",Turma!$B$4:$G$53,3,0)=\"Menina\",tblMLS2!M6,tblMLS2!M174),\"\")","v":""},{"$f":"IF(Turma!A$2=1,IF(VLOOKUP(\"x\",Turma!$B$4:$G$53,3,0)=\"Menina\",tblMLS2!O6,tblMLS2!O174),\"\")","v":""},{"$f":"IF(Turma!A$2=1,IF(VLOOKUP(\"x\",Turma!$B$4:$G$53,3,0)=\"Menina\",tblMLS2!P6,tblMLS2!P174),\"\")","v":""},{"$f":"IF(Turma!A$2=1,IF(VLOOKUP(\"x\",Turma!$B$4:$G$53,3,0)=\"Menina\",tblMLS2!Q6,tblMLS2!Q174),\"\")","v":""},{"$f":"IF(Turma!A$2=1,IF(VLOOKUP(\"x\",Turma!$B$4:$G$53,3,0)=\"Menina\",tblMLS2!S6,tblMLS2!S174),\"\")","v":""},{"$f":"IF(Turma!A$2=1,IF(VLOOKUP(\"x\",Turma!$B$4:$G$53,3,0)=\"Menina\",tblMLS2!U6,tblMLS2!U174),\"\")","v":""}]
[66,"",{"$f":"IF(Turma!A$2=1,IF(VLOOKUP(\"x\",Turma!$B$4:$G$53,3,0)=\"Menina\",tblMLS2!K7,tblMLS2!K175),\"\")","v":""},{"$f":"IF(Turma!A$2=1,IF(VLOOKUP(\"x\",Turma!$B$4:$G$53,3,0)=\"Menina\",tblMLS2!M7,tblMLS2!M175),\"\")","v":""},{"$f":"IF(Turma!A$2=1,IF(VLOOKUP(\"x\",Turma!$B$4:$G$53,3,0)=\"Menina\",tblMLS2!O7,tblMLS2!O175),\"\")","v":""},{"$f":"IF(Turma!A$2=1,IF(VLOOKUP(\"x\",Turma!$B$4:$G$53,3,0)=\"Menina\",tblMLS2!P7,tblMLS2!P175),\"\")","v":""},{"$f":"IF(Turma!A$2=1,IF(VLOOKUP(\"x\",Turma!$B$4:$G$53,3,0)=\"Menina\",tblMLS2!Q7,tblMLS2!Q175),\"\")","v":""},{"$f":"IF(Turma!A$2=1,IF(VLOOKUP(\"x\",Turma!$B$4:$G$53,3,0)=\"Menina\",tblMLS2!S7,tblMLS2!S175),\"\")","v":""},{"$f":"IF(Turma!A$2=1,IF(VLOOKUP(\"x\",Turma!$B$4:$G$53,3,0)=\"Menina\",tblMLS2!U7,tblMLS2!U175),\"\")","v":""}]
[67,"",{"$f":"IF(Turma!A$2=1,IF(VLOOKUP(\"x\",Turma!$B$4:$G$53,3,0)=\"Menina\",tblMLS2!K8,tblMLS2!K176),\"\")","v":""},{"$f":"IF(Turma!A$2=1,IF(VLOOKUP(\"x\",Turma!$B$4:$G$53,3,0)=\"Menina\",tblMLS2!M8,tblMLS2!M176),\"\")","v":""},{"$f":"IF(Turma!A$2=1,IF(VLOOKUP(\"x\",Turma!$B$4:$G$53,3,0)=\"Menina\",tblMLS2!O8,tblMLS2!O176),\"\")","v":""},{"$f":"IF(Turma!A$2=1,IF(VLOOKUP(\"x\",Turma!$B$4:$G$53,3,0)=\"Menina\",tblMLS2!P8,tblMLS2!P176),\"\")","v":""},{"$f":"IF(Turma!A$2=1,IF(VLOOKUP(\"x\",Turma!$B$4:$G$53,3,0)=\"Menina\",tblMLS2!Q8,tblMLS2!Q176),\"\")","v":""},{"$f":"IF(Turma!A$2=1,IF(VLOOKUP(\"x\",Turma!$B$4:$G$53,3,0)=\"Menina\",tblMLS2!S8,tblMLS2!S176),\"\")","v":""},{"$f":"IF(Turma!A$2=1,IF(VLOOKUP(\"x\",Turma!$B$4:$G$53,3,0)=\"Menina\",tblMLS2!U8,tblMLS2!U176),\"\")","v":""}]
[68,"",{"$f":"IF(Turma!A$2=1,IF(VLOOKUP(\"x\",Turma!$B$4:$G$53,3,0)=\"Menina\",tblMLS2!K9,tblMLS2!K177),\"\")","v":""},{"$f":"IF(Turma!A$2=1,IF(VLOOKUP(\"x\",Turma!$B$4:$G$53,3,0)=\"Menina\",tblMLS2!M9,tblMLS2!M177),\"\")","v":""},{"$f":"IF(Turma!A$2=1,IF(VLOOKUP(\"x\",Turma!$B$4:$G$53,3,0)=\"Menina\",tblMLS2!O9,tblMLS2!O177),\"\")","v":""},{"$f":"IF(Turma!A$2=1,IF(VLOOKUP(\"x\",Turma!$B$4:$G$53,3,0)=\"Menina\",tblMLS2!P9,tblMLS2!P177),\"\")","v":""},{"$f":"IF(Turma!A$2=1,IF(VLOOKUP(\"x\",Turma!$B$4:$G$53,3,0)=\"Menina\",tblMLS2!Q9,tblMLS2!Q177),\"\")","v":""},{"$f":"IF(Turma!A$2=1,IF(VLOOKUP(\"x\",Turma!$B$4:$G$53,3,0)=\"Menina\",tblMLS2!S9,tblMLS2!S177),\"\")","v":""},{"$f":"IF(Turma!A$2=1,IF(VLOOKUP(\"x\",Turma!$B$4:$G$53,3,0)=\"Menina\",tblMLS2!U9,tblMLS2!U177),\"\")","v":""}]
[69,"",{"$f":"IF(Turma!A$2=1,IF(VLOOKUP(\"x\",Turma!$B$4:$G$53,3,0)=\"Menina\",tblMLS2!K10,tblMLS2!K178),\"\")","v":""},{"$f":"IF(Turma!A$2=1,IF(VLOOKUP(\"x\",Turma!$B$4:$G$53,3,0)=\"Menina\",tblMLS2!M10,tblMLS2!M178),\"\")","v":""},{"$f":"IF(Turma!A$2=1,IF(VLOOKUP(\"x\",Turma!$B$4:$G$53,3,0)=\"Menina\",tblMLS2!O10,tblMLS2!O178),\"\")","v":""},{"$f":"IF(Turma!A$2=1,IF(VLOOKUP(\"x\",Turma!$B$4:$G$53,3,0)=\"Menina\",tblMLS2!P10,tblMLS2!P178),\"\")","v":""},{"$f":"IF(Turma!A$2=1,IF(VLOOKUP(\"x\",Turma!$B$4:$G$53,3,0)=\"Menina\",tblMLS2!Q10,tblMLS2!Q178),\"\")","v":""},{"$f":"IF(Turma!A$2=1,IF(VLOOKUP(\"x\",Turma!$B$4:$G$53,3,0)=\"Menina\",tblMLS2!S10,tblMLS2!S178),\"\")","v":""},{"$f":"IF(Turma!A$2=1,IF(VLOOKUP(\"x\",Turma!$B$4:$G$53,3,0)=\"Menina\",tblMLS2!U10,tblMLS2!U178),\"\")","v":""}]
[70,"",{"$f":"IF(Turma!A$2=1,IF(VLOOKUP(\"x\",Turma!$B$4:$G$53,3,0)=\"Menina\",tblMLS2!K11,tblMLS2!K179),\"\")","v":""},{"$f":"IF(Turma!A$2=1,IF(VLOOKUP(\"x\",Turma!$B$4:$G$53,3,0)=\"Menina\",tblMLS2!M11,tblMLS2!M179),\"\")","v":""},{"$f":"IF(Turma!A$2=1,IF(VLOOKUP(\"x\",Turma!$B$4:$G$53,3,0)=\"Menina\",tblMLS2!O11,tblMLS2!O179),\"\")","v":""},{"$f":"IF(Turma!A$2=1,IF(VLOOKUP(\"x\",Turma!$B$4:$G$53,3,0)=\"Menina\",tblMLS2!P11,tblMLS2!P179),\"\")","v":""},{"$f":"IF(Turma!A$2=1,IF(VLOOKUP(\"x\",Turma!$B$4:$G$53,3,0)=\"Menina\",tblMLS2!Q11,tblMLS2!Q179),\"\")","v":""},{"$f":"IF(Turma!A$2=1,IF(VLOOKUP(\"x\",Turma!$B$4:$G$53,3,0)=\"Menina\",tblMLS2!S11,tblMLS2!S179),\"\")","v":""},{"$f":"IF(Turma!A$2=1,IF(VLOOKUP(\"x\",Turma!$B$4:$G$53,3,0)=\"Menina\",tblMLS2!U11,tblMLS2!U179),\"\")","v":""}]
[71,"",{"$f":"IF(Turma!A$2=1,IF(VLOOKUP(\"x\",Turma!$B$4:$G$53,3,0)=\"Menina\",tblMLS2!K12,tblMLS2!K180),\"\")","v":""},{"$f":"IF(Turma!A$2=1,IF(VLOOKUP(\"x\",Turma!$B$4:$G$53,3,0)=\"Menina\",tblMLS2!M12,tblMLS2!M180),\"\")","v":""},{"$f":"IF(Turma!A$2=1,IF(VLOOKUP(\"x\",Turma!$B$4:$G$53,3,0)=\"Menina\",tblMLS2!O12,tblMLS2!O180),\"\")","v":""},{"$f":"IF(Turma!A$2=1,IF(VLOOKUP(\"x\",Turma!$B$4:$G$53,3,0)=\"Menina\",tblMLS2!P12,tblMLS2!P180),\"\")","v":""},{"$f":"IF(Turma!A$2=1,IF(VLOOKUP(\"x\",Turma!$B$4:$G$53,3,0)=\"Menina\",tblMLS2!Q12,tblMLS2!Q180),\"\")","v":""},{"$f":"IF(Turma!A$2=1,IF(VLOOKUP(\"x\",Turma!$B$4:$G$53,3,0)=\"Menina\",tblMLS2!S12,tblMLS2!S180),\"\")","v":""},{"$f":"IF(Turma!A$2=1,IF(VLOOKUP(\"x\",Turma!$B$4:$G$53,3,0)=\"Menina\",tblMLS2!U12,tblMLS2!U180),\"\")","v":""}]
[72,6,{"$f":"IF(Turma!A$2=1,IF(VLOOKUP(\"x\",Turma!$B$4:$G$53,3,0)=\"Menina\",tblMLS2!K13,tblMLS2!K181),\"\")","v":""},{"$f":"IF(Turma!A$2=1,IF(VLOOKUP(\"x\",Turma!$B$4:$G$53,3,0)=\"Menina\",tblMLS2!M13,tblMLS2!M181),\"\")","v":""},{"$f":"IF(Turma!A$2=1,IF(VLOOKUP(\"x\",Turma!$B$4:$G$53,3,0)=\"Menina\",tblMLS2!O13,tblMLS2!O181),\"\")","v":""},{"$f":"IF(Turma!A$2=1,IF(VLOOKUP(\"x\",Turma!$B$4:$G$53,3,0)=\"Menina\",tblMLS2!P13,tblMLS2!P181),\"\")","v":""},{"$f":"IF(Turma!A$2=1,IF(VLOOKUP(\"x\",Turma!$B$4:$G$53,3,0)=\"Menina\",tblMLS2!Q13,tblMLS2!Q181),\"\")","v":""},{"$f":"IF(Turma!A$2=1,IF(VLOOKUP(\"x\",Turma!$B$4:$G$53,3,0)=\"Menina\",tblMLS2!S13,tblMLS2!S181),\"\")","v":""},{"$f":"IF(Turma!A$2=1,IF(VLOOKUP(\"x\",Turma!$B$4:$G$53,3,0)=\"Menina\",tblMLS2!U13,tblMLS2!U181),\"\")","v":""}]
[73,"",{"$f":"IF(Turma!A$2=1,IF(VLOOKUP(\"x\",Turma!$B$4:$G$53,3,0)=\"Menina\",tblMLS2!K14,tblMLS2!K182),\"\")","v":""},{"$f":"IF(Turma!A$2=1,IF(VLOOKUP(\"x\",Turma!$B$4:$G$53,3,0)=\"Menina\",tblMLS2!M14,tblMLS2!M182),\"\")","v":""},{"$f":"IF(Turma!A$2=1,IF(VLOOKUP(\"x\",Turma!$B$4:$G$53,3,0)=\"Menina\",tblMLS2!O14,tblMLS2!O182),\"\")","v":""},{"$f":"IF(Turma!A$2=1,IF(VLOOKUP(\"x\",Turma!$B$4:$G$53,3,0)=\"Menina\",tblMLS2!P14,tblMLS2!P182),\"\")","v":""},{"$f":"IF(Turma!A$2=1,IF(VLOOKUP(\"x\",Turma!$B$4:$G$53,3,0)=\"Menina\",tblMLS2!Q14,tblMLS2!Q182),\"\")","v":""},{"$f":"IF(Turma!A$2=1,IF(VLOOKUP(\"x\",Turma!$B$4:$G$53,3,0)=\"Menina\",tblMLS2!S14,tblMLS2!S182),\"\")","v":""},{"$f":"IF(Turma!A$2=1,IF(VLOOKUP(\"x\",Turma!$B$4:$G$53,3,0)=\"Menina\",tblMLS2!U14,tblMLS2!U182),\"\")","v":""}]
[74,"",{"$f":"IF(Turma!A$2=1,IF(VLOOKUP(\"x\",Turma!$B$4:$G$53,3,0)=\"Menina\",tblMLS2!K15,tblMLS2!K183),\"\")","v":""},{"$f":"IF(Turma!A$2=1,IF(VLOOKUP(\"x\",Turma!$B$4:$G$53,3,0)=\"Menina\",tblMLS2!M15,tblMLS2!M183),\"\")","v":""},{"$f":"IF(Turma!A$2=1,IF(VLOOKUP(\"x\",Turma!$B$4:$G$53,3,0)=\"Menina\",tblMLS2!O15,tblMLS2!O183),\"\")","v":""},{"$f":"IF(Turma!A$2=1,IF(VLOOKUP(\"x\",Turma!$B$4:$G$53,3,0)=\"Menina\",tblMLS2!P15,tblMLS2!P183),\"\")","v":""},{"$f":"IF(Turma!A$2=1,IF(VLOOKUP(\"x\",Turma!$B$4:$G$53,3,0)=\"Menina\",tblMLS2!Q15,tblMLS2!Q183),\"\")","v":""},{"$f":"IF(Turma!A$2=1,IF(VLOOKUP(\"x\",Turma!$B$4:$G$53,3,0)=\"Menina\",tblMLS2!S15,tblMLS2!S183),\"\")","v":""},{"$f":"IF(Turma!A$2=1,IF(VLOOKUP(\"x\",Turma!$B$4:$G$53,3,0)=\"Menina\",tblMLS2!U15,tblMLS2!U183),\"\")","v":""}]
[75,"",{"$f":"IF(Turma!A$2=1,IF(VLOOKUP(\"x\",Turma!$B$4:$G$53,3,0)=\"Menina\",tblMLS2!K16,tblMLS2!K184),\"\")","v":""},{"$f":"IF(Turma!A$2=1,IF(VLOOKUP(\"x\",Turma!$B$4:$G$53,3,0)=\"Menina\",tblMLS2!M16,tblMLS2!M184),\"\")","v":""},{"$f":"IF(Turma!A$2=1,IF(VLOOKUP(\"x\",Turma!$B$4:$G$53,3,0)=\"Menina\",tblMLS2!O16,tblMLS2!O184),\"\")","v":""},{"$f":"IF(Turma!A$2=1,IF(VLOOKUP(\"x\",Turma!$B$4:$G$53,3,0)=\"Menina\",tblMLS2!P16,tblMLS2!P184),\"\")","v":""},{"$f":"IF(Turma!A$2=1,IF(VLOOKUP(\"x\",Turma!$B$4:$G$53,3,0)=\"Menina\",tblMLS2!Q16,tblMLS2!Q184),\"\")","v":""},{"$f":"IF(Turma!A$2=1,IF(VLOOKUP(\"x\",Turma!$B$4:$G$53,3,0)=\"Menina\",tblMLS2!S16,tblMLS2!S184),\"\")","v":""},{"$f":"IF(Turma!A$2=1,IF(VLOOKUP(\"x\",Turma!$B$4:$G$53,3,0)=\"Menina\",tblMLS2!U16,tblMLS2!U184),\"\")","v":""}]
[76,"",{"$f":"IF(Turma!A$2=1,IF(VLOOKUP(\"x\",Turma!$B$4:$G$53,3,0)=\"Menina\",tblMLS2!K17,tblMLS2!K185),\"\")","v":""},{"$f":"IF(Turma!A$2=1,IF(VLOOKUP(\"x\",Turma!$B$4:$G$53,3,0)=\"Menina\",tblMLS2!M17,tblMLS2!M185),\"\")","v":""},{"$f":"IF(Turma!A$2=1,IF(VLOOKUP(\"x\",Turma!$B$4:$G$53,3,0)=\"Menina\",tblMLS2!O17,tblMLS2!O185),\"\")","v":""},{"$f":"IF(Turma!A$2=1,IF(VLOOKUP(\"x\",Turma!$B$4:$G$53,3,0)=\"Menina\",tblMLS2!P17,tblMLS2!P185),\"\")","v":""},{"$f":"IF(Turma!A$2=1,IF(VLOOKUP(\"x\",Turma!$B$4:$G$53,3,0)=\"Menina\",tblMLS2!Q17,tblMLS2!Q185),\"\")","v":""},{"$f":"IF(Turma!A$2=1,IF(VLOOKUP(\"x\",Turma!$B$4:$G$53,3,0)=\"Menina\",tblMLS2!S17,tblMLS2!S185),\"\")","v":""},{"$f":"IF(Turma!A$2=1,IF(VLOOKUP(\"x\",Turma!$B$4:$G$53,3,0)=\"Menina\",tblMLS2!U17,tblMLS2!U185),\"\")","v":""}]
[77,"",{"$f":"IF(Turma!A$2=1,IF(VLOOKUP(\"x\",Turma!$B$4:$G$53,3,0)=\"Menina\",tblMLS2!K18,tblMLS2!K186),\"\")","v":""},{"$f":"IF(Turma!A$2=1,IF(VLOOKUP(\"x\",Turma!$B$4:$G$53,3,0)=\"Menina\",tblMLS2!M18,tblMLS2!M186),\"\")","v":""},{"$f":"IF(Turma!A$2=1,IF(VLOOKUP(\"x\",Turma!$B$4:$G$53,3,0)=\"Menina\",tblMLS2!O18,tblMLS2!O186),\"\")","v":""},{"$f":"IF(Turma!A$2=1,IF(VLOOKUP(\"x\",Turma!$B$4:$G$53,3,0)=\"Menina\",tblMLS2!P18,tblMLS2!P186),\"\")","v":""},{"$f":"IF(Turma!A$2=1,IF(VLOOKUP(\"x\",Turma!$B$4:$G$53,3,0)=\"Menina\",tblMLS2!Q18,tblMLS2!Q186),\"\")","v":""},{"$f":"IF(Turma!A$2=1,IF(VLOOKUP(\"x\",Turma!$B$4:$G$53,3,0)=\"Menina\",tblMLS2!S18,tblMLS2!S186),\"\")","v":""},{"$f":"IF(Turma!A$2=1,IF(VLOOKUP(\"x\",Turma!$B$4:$G$53,3,0)=\"Menina\",tblMLS2!U18,tblMLS2!U186),\"\")","v":""}]
[78,"",{"$f":"IF(Turma!A$2=1,IF(VLOOKUP(\"x\",Turma!$B$4:$G$53,3,0)=\"Menina\",tblMLS2!K19,tblMLS2!K187),\"\")","v":""},{"$f":"IF(Turma!A$2=1,IF(VLOOKUP(\"x\",Turma!$B$4:$G$53,3,0)=\"Menina\",tblMLS2!M19,tblMLS2!M187),\"\")","v":""},{"$f":"IF(Turma!A$2=1,IF(VLOOKUP(\"x\",Turma!$B$4:$G$53,3,0)=\"Menina\",tblMLS2!O19,tblMLS2!O187),\"\")","v":""},{"$f":"IF(Turma!A$2=1,IF(VLOOKUP(\"x\",Turma!$B$4:$G$53,3,0)=\"Menina\",tblMLS2!P19,tblMLS2!P187),\"\")","v":""},{"$f":"IF(Turma!A$2=1,IF(VLOOKUP(\"x\",Turma!$B$4:$G$53,3,0)=\"Menina\",tblMLS2!Q19,tblMLS2!Q187),\"\")","v":""},{"$f":"IF(Turma!A$2=1,IF(VLOOKUP(\"x\",Turma!$B$4:$G$53,3,0)=\"Menina\",tblMLS2!S19,tblMLS2!S187),\"\")","v":""},{"$f":"IF(Turma!A$2=1,IF(VLOOKUP(\"x\",Turma!$B$4:$G$53,3,0)=\"Menina\",tblMLS2!U19,tblMLS2!U187),\"\")","v":""}]
{"$rows_left_out":151}
{"sheet":"tblMLS2","index":3,"n_rows":337,"n_cols":37,"rows_kept":337,"cut":false,"hidden":true,"merged":[]}
["idLMS","variavel","genero","meses","L","M","S","StDev","P01","P1","P3","P5","P10","P15","P25","P50","P75","P85","P90","P95","P97","P99","P999","L","M","S","StDev","SD5neg","SD4neg","SD3neg","SD2neg","SD1neg","SD0","SD1","SD2","SD3","SD4"]
[1,"altura","menina",61]
[2,"altura","menina",{"$f":"D2+1","v":62}]
[3,"altura","menina",{"$f":"D3+1","v":63}]
[4,"altura","menina",64]
[5,"altura","menina",65]
[6,"altura","menina",66]
[7,"altura","menina",67]
[8,"altura","menina",68]
[9,"altura","menina",69]
[10,"altura","menina",70]
[11,"altura","menina",71]
[12,"altura","menina",72,0.54611739999999998,114.9111,3.9699999999999999E-2,null,null,null,105.9425,null,108.89530000000001,null,111.8848,114.9111,117.974,null,121.0733,null,124.2092]
[13,"altura","menina",73]
[14,"altura","menina",74]
[15,"altura","menina",75]
[16,"altura","menina",76]
[17,"altura","menina",77]
[18,"altura","menina",78,null,null,null,null,null,null,108.4379,null,111.57989999999999,null,114.7808,118.041,121.3612,null,124.7419,null,128.18350000000001]
[19,"altura","menina",79]
{"$rows_left_out":317}