{"text_format":"1","workbook":"xlsx","n_sheets":6,"sheets":["Turma","Relatório","pesoPercentis","imcPercentis","matPeso","matIMC"],"not_rendered":{"charts":0,"images":4,"macros":1,"external_links":0,"defined_names":2,"comments":1,"pivot_tables":0},"unopened":[],"bounds":{"document_bytes":16777216,"sheet_cells":100000,"rows_first":2000,"rows_last":500,"rows_between":2000,"halvings":0,"cell_chars":16384,"cell_head_chars":4096},"cells_cut":0,"cells_raw":0,"read":"whole","date_system":"1900"}

{"sheet":"Turma","index":0,"n_rows":53,"n_cols":10,"rows_kept":53,"cut":false,"hidden":false,"merged":[]}
[null,"Ano:",null,null,null,"Média Global:",{"$f":"IF(COUNTA(G4:G53)>0,AVERAGE(G4:G53),\"\")","v":""},{"$f":"IF(COUNTA(H4:H53)>0,AVERAGE(H4:H53),\"\")","v":""},{"$f":"IF(COUNTA(I4:I53)>0,AVERAGE(I4:I53),\"\")","v":{"$error":"#DIV/0!"}},{"$f":"IF(COUNTA(J4:J53)>0,AVERAGE(J4:J53),\"\")","v":{"$error":"#DIV/0!"}}]
[{"$f":"COUNTIF(B4:B53,\"x\")","v":0},"Turma:",null,null,null,"Desvio Padrão Global:",{"$f":"IF(COUNTA(G4:G53)>0,_xlfn.STDEV.P(G4:G53),\"\")","v":""},{"$f":"IF(COUNTA(H4:H53)>0,_xlfn.STDEV.P(H4:H53),\"\")","v":""},{"$f":"IF(COUNTA(I4:I53)>0,_xlfn.STDEV.P(I4:I53),\"\")","v":{"$error":"#DIV/0!"}},{"$f":"IF(COUNTA(J4:J53)>0,_xlfn.STDEV.P(J4:J53),\"\")","v":{"$error":"#DIV/0!"}}]
["ID Aluno",{"$f":"_xlfn.CONCAT(\"Ver: \",A2)","v":"Ver: 0"},"Nome","Género","Data de nascimento","Data de avaliação","Peso","Altura","Idade","IMC"]
[1,null,null,null,null,null,null,null,{"$f":"IF(AND(E4<>\"\",F4<>\"\"),INT(12*_xlfn.DAYS(F4,E4)/365),\"\")","v":""},{"$f":"IF(H4<>0,G4/(H4/100*H4/100),\"\")","v":""}]
[{"$f":"A4+1","v":2},null,null,null,null,null,null,null,{"$f":"IF(AND(E5<>\"\",F5<>\"\"),INT(12*_xlfn.DAYS(F5,E5)/365),\"\")","v":""},{"$f":"IF(H5<>0,G5/(H5/100*H5/100),\"\")","v":""}]
[{"$f":"A5+1","v":3},null,null,null,null,null,null,null,"",""]
[4,null,null,null,null,null,null,null,"",""]
[5,null,null,null,null,null,null,null,"",""]
[6,null,null,null,null,null,null,null,"",""]
[7,null,null,null,null,null,null,null,"",""]
{"$rows_left_out":44}
{"sheet":"Relatório","index":1,"n_rows":48,"n_cols":11,"rows_kept":48,"cut":false,"hidden":false,"merged":[[11,0,11,9],[31,0,31,5]]}
["RELATÓRIO INDIVIDUAL - PESO E "]
["ÍNDICE DE MASSA CORPORAL"]
[{"$f":"IF(Turma!A2=1,VLOOKUP(\"x\",Turma!B4:G53,2,0),\"\")","v":""}]
[{"$f":"IF(Turma!A2=1,_xlfn.CONCAT(TEXT(VLOOKUP(\"x\",Turma!B$4:G$53,4,0),\"dd-mm-aaaa\"),\" | \",Turma!C1,\"º ano\",\" | \",Turma!C2),\"\")","v":""}]
[null,"Resultado",null,"Média",null,"Mínimo",null,"Máximo"]
[null,"da criança",null,"da turma",null,"da turma",null,"da turma"]
["Peso (kg)",{"$f":"IF(Turma!$A$2=1,IF(VLOOKUP(\"x\",Turma!B4:J53,6,0)=0,0,VLOOKUP(\"x\",Turma!B4:J53,6,0)),0)","v":0},null,{"$f":"IF(AND(Turma!$A$2=1,COUNTA(Turma!$G$4:$G$53)>0),Turma!$G$1,0)","v":0},null,{"$f":"IF(AND(Turma!$A$2=1,COUNTA(Turma!$G$4:$G$53)>0),SMALL(Turma!$G$4:$G$53,1),0)","v":0},null,{"$f":"IF(AND(Turma!$A$2=1,COUNTA(Turma!$G$4:$G$53)>0),LARGE(Turma!$G$4:$G$53,1),0)","v":0}]
[]
["IMC (kg/m2)",{"$f":"IF(Turma!$A$2=1,IF(VLOOKUP(\"x\",Turma!B4:J53,9,0)=0,0,VLOOKUP(\"x\",Turma!B4:J53,9,0)),0)","v":0},null,{"$f":"IF(AND(Turma!$A$2=1,AND(COUNTA(Turma!$J$4:$J$53)>0),COUNTA(Turma!$H$4:$H$53)>0),Turma!$J$1,0)","v":0},null,{"$f":"IF(AND(Turma!$A$2=1,AND(COUNTA(Turma!$G$4:$G$53)>0,COUNTA(Turma!$H$4:$H$53)>0)),SMALL(Turma!$J$4:$J$53,1),0)","v":0},null,{"$f":"IF(AND(Turma!$A$2=1,AND(COUNTA(Turma!$G$4:$G$53)>0,COUNTA(Turma!$H$4:$H$53)>0)),LARGE(Turma!$J$4:$J$53,1),0)","v":0}]
[]
{"$rows_left_out":39}
{"sheet":"pesoPercentis","index":2,"n_rows":68,"n_cols":13,"rows_kept":68,"cut":false,"hidden":true,"merged":[]}
["meses","anos","P3","P10","P25","P50","P75","P90","P97",null,"Género","Meses","Peso"]
[60,{"$f":"IF(A2/12=INT(A2/12),A2/12,\"\")","v":5},null,null,null,null,null,null,null,null,{"$f":"IF(Turma!A2=1,VLOOKUP(\"x\",Turma!B4:H53,3,0),\"\")","v":""},{"$f":"IF(Turma!A2=1,VLOOKUP(\"x\",Turma!B4:I53,8,0),\"\")","v":""},{"$f":"IF(Turma!A2=1,VLOOKUP(\"x\",Turma!B4:I53,6,0),\"\")","v":""}]
[61,{"$f":"IF(A3/12=INT(A3/12),A3/12,\"\")","v":""},{"$f":"IF(Turma!A$2=1,IF(VLOOKUP(\"x\",Turma!$B$4:$H$53,3,0)=\"Menina\",matPeso!J2,matPeso!J68),\"\")","v":""},{"$f":"IF(Turma!A$2=1,IF(VLOOKUP(\"x\",Turma!$B$4:$H$53,3,0)=\"Menina\",matPeso!L2,matPeso!L68),\"\")","v":""},{"$f":"IF(Turma!A$2=1,IF(VLOOKUP(\"x\",Turma!$B$4:$H$53,3,0)=\"Menina\",matPeso!N2,matPeso!N68),\"\")","v":""},{"$f":"IF(Turma!A$2=1,IF(VLOOKUP(\"x\",Turma!$B$4:$H$53,3,0)=\"Menina\",matPeso!O2,matPeso!O68),\"\")","v":""},{"$f":"IF(Turma!A$2=1,IF(VLOOKUP(\"x\",Turma!$B$4:$H$53,3,0)=\"Menina\",matPeso!P2,matPeso!P68),\"\")","v":""},{"$f":"IF(Turma!A$2=1,IF(VLOOKUP(\"x\",Turma!$B$4:$H$53,3,0)=\"Menina\",matPeso!R2,matPeso!R68),\"\")","v":""},{"$f":"IF(Turma!A$2=1,IF(VLOOKUP(\"x\",Turma!$B$4:$H$53,3,0)=\"Menina\",matPeso!T2,matPeso!T68),\"\")","v":""}]
[62,"",{"$f":"IF(Turma!A$2=1,IF(VLOOKUP(\"x\",Turma!$B$4:$H$53,3,0)=\"Menina\",matPeso!J3,matPeso!J69),\"\")","v":""},{"$f":"IF(Turma!A$2=1,IF(VLOOKUP(\"x\",Turma!$B$4:$H$53,3,0)=\"Menina\",matPeso!L3,matPeso!L69),\"\")","v":""},{"$f":"IF(Turma!A$2=1,IF(VLOOKUP(\"x\",Turma!$B$4:$H$53,3,0)=\"Menina\",matPeso!N3,matPeso!N69),\"\")","v":""},{"$f":"IF(Turma!A$2=1,IF(VLOOKUP(\"x\",Turma!$B$4:$H$53,3,0)=\"Menina\",matPeso!O3,matPeso!O69),\"\")","v":""},{"$f":"IF(Turma!A$2=1,IF(VLOOKUP(\"x\",Turma!$B$4:$H$53,3,0)=\"Menina\",matPeso!P3,matPeso!P69),\"\")","v":""},{"$f":"IF(Turma!A$2=1,IF(VLOOKUP(\"x\",Turma!$B$4:$H$53,3,0)=\"Menina\",matPeso!R3,matPeso!R69),\"\")","v":""},{"$f":"IF(Turma!A$2=1,IF(VLOOKUP(\"x\",Turma!$B$4:$H$53,3,0)=\"Menina\",matPeso!T3,matPeso!T69),\"\")","v":""}]
[63,"",{"$f":"IF(Turma!A$2=1,IF(VLOOKUP(\"x\",Turma!$B$4:$H$53,3,0)=\"Menina\",matPeso!J4,matPeso!J70),\"\")","v":""},{"$f":"IF(Turma!A$2=1,IF(VLOOKUP(\"x\",Turma!$B$4:$H$53,3,0)=\"Menina\",matPeso!L4,matPeso!L70),\"\")","v":""},{"$f":"IF(Turma!A$2=1,IF(VLOOKUP(\"x\",Turma!$B$4:$H$53,3,0)=\"Menina\",matPeso!N4,matPeso!N70),\"\")","v":""},{"$f":"IF(Turma!A$2=1,IF(VLOOKUP(\"x\",Turma!$B$4:$H$53,3,0)=\"Menina\",matPeso!O4,matPeso!O70),\"\")","v":""},{"$f":"IF(Turma!A$2=1,IF(VLOOKUP(\"x\",Turma!$B$4:$H$53,3,0)=\"Menina\",matPeso!P4,matPeso!P70),\"\")","v":""},{"$f":"IF(Turma!A$2=1,IF(VLOOKUP(\"x\",Turma!$B$4:$H$53,3,0)=\"Menina\",matPeso!R4,matPeso!R70),\"\")","v":""},{"$f":"IF(Turma!A$2=1,IF(VLOOKUP(\"x\",Turma!$B$4:$H$53,3,0)=\"Menina\",matPeso!T4,matPeso!T70),\"\")","v":""}]
[64,"",{"$f":"IF(Turma!A$2=1,IF(VLOOKUP(\"x\",Turma!$B$4:$H$53,3,0)=\"Menina\",matPeso!J5,matPeso!J71),\"\")","v":""},{"$f":"IF(Turma!A$2=1,IF(VLOOKUP(\"x\",Turma!$B$4:$H$53,3,0)=\"Menina\",matPeso!L5,matPeso!L71),\"\")","v":""},{"$f":"IF(Turma!A$2=1,IF(VLOOKUP(\"x\",Turma!$B$4:$H$53,3,0)=\"Menina\",matPeso!N5,matPeso!N71),\"\")","v":""},{"$f":"IF(Turma!A$2=1,IF(VLOOKUP(\"x\",Turma!$B$4:$H$53,3,0)=\"Menina\",matPeso!O5,matPeso!O71),\"\")","v":""},{"$f":"IF(Turma!A$2=1,IF(VLOOKUP(\"x\",Turma!$B$4:$H$53,3,0)=\"Menina\",matPeso!P5,matPeso!P71),\"\")","v":""},{"$f":"IF(Turma!A$2=1,IF(VLOOKUP(\"x\",Turma!$B$4:$H$53,3,0)=\"Menina\",matPeso!R5,matPeso!R71),\"\")","v":""},{"$f":"IF(Turma!A$2=1,IF(VLOOKUP(\"x\",Turma!$B$4:$H$53,3,0)=\"Menina\",matPeso!T5,matPeso!T71),\"\")","v":""}]
[65,"",{"$f":"IF(Turma!A$2=1,IF(VLOOKUP(\"x\",Turma!$B$4:$H$53,3,0)=\"Menina\",matPeso!J6,matPeso!J72),\"\")","v":""},{"$f":"IF(Turma!A$2=1,IF(VLOOKUP(\"x\",Turma!$B$4:$H$53,3,0)=\"Menina\",matPeso!L6,matPeso!L72),\"\")","v":""},{"$f":"IF(Turma!A$2=1,IF(VLOOKUP(\"x\",Turma!$B$4:$H$53,3,0)=\"Menina\",matPeso!N6,matPeso!N72),\"\")","v":""},{"$f":"IF(Turma!A$2=1,IF(VLOOKUP(\"x\",Turma!$B$4:$H$53,3,0)=\"Menina\",matPeso!O6,matPeso!O72),\"\")","v":""},{"$f":"IF(Turma!A$2=1,IF(VLOOKUP(\"x\",Turma!$B$4:$H$53,3,0)=\"Menina\",matPeso!P6,matPeso!P72),\"\")","v":""},{"$f":"IF(Turma!A$2=1,IF(VLOOKUP(\"x\",Turma!$B$4:$H$53,3,0)=\"Menina\",matPeso!R6,matPeso!R72),\"\")","v":""},{"$f":"IF(Turma!A$2=1,IF(VLOOKUP(\"x\",Turma!$B$4:$H$53,3,0)=\"Menina\",matPeso!T6,matPeso!T72),\"\")","v":""}]
[66,"",{"$f":"IF(Turma!A$2=1,IF(VLOOKUP(\"x\",Turma!$B$4:$H$53,3,0)=\"Menina\",matPeso!J7,matPeso!J73),\"\")","v":""},{"$f":"IF(Turma!A$2=1,IF(VLOOKUP(\"x\",Turma!$B$4:$H$53,3,0)=\"Menina\",matPeso!L7,matPeso!L73),\"\")","v":""},{"$f":"IF(Turma!A$2=1,IF(VLOOKUP(\"x\",Turma!$B$4:$H$53,3,0)=\"Menina\",matPeso!N7,matPeso!N73),\"\")","v":""},{"$f":"IF(Turma!A$2=1,IF(VLOOKUP(\"x\",Turma!$B$4:$H$53,3,0)=\"Menina\",matPeso!O7,matPeso!O73),\"\")","v":""},{"$f":"IF(Turma!A$2=1,IF(VLOOKUP(\"x\",Turma!$B$4:$H$53,3,0)=\"Menina\",matPeso!P7,matPeso!P73),\"\")","v":""},{"$f":"IF(Turma!A$2=1,IF(VLOOKUP(\"x\",Turma!$B$4:$H$53,3,0)=\"Menina\",matPeso!R7,matPeso!R73),\"\")","v":""},{"$f":"IF(Turma!A$2=1,IF(VLOOKUP(\"x\",Turma!$B$4:$H$53,3,0)=\"Menina\",matPeso!T7,matPeso!T73),\"\")","v":""}]
[67,"",{"$f":"IF(Turma!A$2=1,IF(VLOOKUP(\"x\",Turma!$B$4:$H$53,3,0)=\"Menina\",matPeso!J8,matPeso!J74),\"\")","v":""},{"$f":"IF(Turma!A$2=1,IF(VLOOKUP(\"x\",Turma!$B$4:$H$53,3,0)=\"Menina\",matPeso!L8,matPeso!L74),\"\")","v":""},{"$f":"IF(Turma!A$2=1,IF(VLOOKUP(\"x\",Turma!$B$4:$H$53,3,0)=\"Menina\",matPeso!N8,matPeso!N74),\"\")","v":""},{"$f":"IF(Turma!A$2=1,IF(VLOOKUP(\"x\",Turma!$B$4:$H$53,3,0)=\"Menina\",matPeso!O8,matPeso!O74),\"\")","v":""},{"$f":"IF(Turma!A$2=1,IF(VLOOKUP(\"x\",Turma!$B$4:$H$53,3,0)=\"Menina\",matPeso!P8,matPeso!P74),\"\")","v":""},{"$f":"IF(Turma!A$2=1,IF(VLOOKUP(\"x\",Turma!$B$4:$H$53,3,0)=\"Menina\",matPeso!R8,matPeso!R74),\"\")","v":""},{"$f":"IF(Turma!A$2=1,IF(VLOOKUP(\"x\",Turma!$B$4:$H$53,3,0)=\"Menina\",matPeso!T8,matPeso!T74),\"\")","v":""}]
[68,"",{"$f":"IF(Turma!A$2=1,IF(VLOOKUP(\"x\",Turma!$B$4:$H$53,3,0)=\"Menina\",matPeso!J9,matPeso!J75),\"\")","v":""},{"$f":"IF(Turma!A$2=1,IF(VLOOKUP(\"x\",Turma!$B$4:$H$53,3,0)=\"Menina\",matPeso!L9,matPeso!L75),\"\")","v":""},{"$f":"IF(Turma!A$2=1,IF(VLOOKUP(\"x\",Turma!$B$4:$H$53,3,0)=\"Menina\",matPeso!N9,matPeso!N75),\"\")","v":""},{"$f":"IF(Turma!A$2=1,IF(VLOOKUP(\"x\",Turma!$B$4:$H$53,3,0)=\"Menina\",matPeso!O9,matPeso!O75),\"\")","v":""},{"$f":"IF(Turma!A$2=1,IF(VLOOKUP(\"x\",Turma!$B$4:$H$53,3,0)=\"Menina\",matPeso!P9,matPeso!P75),\"\")","v":""},{"$f":"IF(Turma!A$2=1,IF(VLOOKUP(\"x\",Turma!$B$4:$H$53,3,0)=\"Menina\",matPeso!R9,matPeso!R75),\"\")","v":""},{"$f":"IF(Turma!A$2=1,IF(VLOOKUP(\"x\",Turma!$B$4:$H$53,3,0)=\"Menina\",matPeso!T9,matPeso!T75),\"\")","v":""}]
{"$rows_left_out":59}
{"sheet":"imcPercentis","index":3,"n_rows":68,"n_cols":13,"rows_kept":68,"cut":false,"hidden":true,"merged":[]}
["meses","anos","P3","P10","P25","P50","P75","P90","P97",null,"Género","Meses","IMC"]
[60,{"$f":"IF(A2/12=INT(A2/12),A2/12,\"\")","v":5},null,null,null,null,null,null,null,null,{"$f":"IF(Turma!A2=1,VLOOKUP(\"x\",Turma!B4:H53,3,0),\"\")","v":""},{"$f":"IF(Turma!A2=1,VLOOKUP(\"x\",Turma!B4:I53,8,0),\"\")","v":""},{"$f":"IF(Turma!A2=1,VLOOKUP(\"x\",Turma!B4:J53,9,0),\"\")","v":""}]
[61,{"$f":"IF(A3/12=INT(A3/12),A3/12,\"\")","v":""},{"$f":"IF(Turma!A$2=1,IF(VLOOKUP(\"x\",Turma!$B$4:$H$53,3,0)=\"Menina\",matIMC!J2,matIMC!J68),\"\")","v":""},{"$f":"IF(Turma!A$2=1,IF(VLOOKUP(\"x\",Turma!$B$4:$H$53,3,0)=\"Menina\",matIMC!L2,matIMC!L68),\"\")","v":""},{"$f":"IF(Turma!A$2=1,IF(VLOOKUP(\"x\",Turma!$B$4:$H$53,3,0)=\"Menina\",matIMC!N2,matIMC!N68),\"\")","v":""},{"$f":"IF(Turma!A$2=1,IF(VLOOKUP(\"x\",Turma!$B$4:$H$53,3,0)=\"Menina\",matIMC!O2,matIMC!O68),\"\")","v":""},{"$f":"IF(Turma!A$2=1,IF(VLOOKUP(\"x\",Turma!$B$4:$H$53,3,0)=\"Menina\",matIMC!P2,matIMC!P68),\"\")","v":""},{"$f":"IF(Turma!A$2=1,IF(VLOOKUP(\"x\",Turma!$B$4:$H$53,3,0)=\"Menina\",matIMC!R2,matIMC!R68),\"\")","v":""},{"$f":"IF(Turma!A$2=1,IF(VLOOKUP(\"x\",Turma!$B$4:$H$53,3,0)=\"Menina\",matIMC!T2,matIMC!T68),\"\")","v":""}]
[62,"",{"$f":"IF(Turma!A$2=1,IF(VLOOKUP(\"x\",Turma!$B$4:$H$53,3,0)=\"Menina\",matIMC!J3,matIMC!J69),\"\")","v":""},{"$f":"IF(Turma!A$2=1,IF(VLOOKUP(\"x\",Turma!$B$4:$H$53,3,0)=\"Menina\",matIMC!L3,matIMC!L69),\"\")","v":""},{"$f":"IF(Turma!A$2=1,IF(VLOOKUP(\"x\",Turma!$B$4:$H$53,3,0)=\"Menina\",matIMC!N3,matIMC!N69),\"\")","v":""},{"$f":"IF(Turma!A$2=1,IF(VLOOKUP(\"x\",Turma!$B$4:$H$53,3,0)=\"Menina\",matIMC!O3,matIMC!O69),\"\")","v":""},{"$f":"IF(Turma!A$2=1,IF(VLOOKUP(\"x\",Turma!$B$4:$H$53,3,0)=\"Menina\",matIMC!P3,matIMC!P69),\"\")","v":""},{"$f":"IF(Turma!A$2=1,IF(VLOOKUP(\"x\",Turma!$B$4:$H$53,3,0)=\"Menina\",matIMC!R3,matIMC!R69),\"\")","v":""},{"$f":"IF(Turma!A$2=1,IF(VLOOKUP(\"x\",Turma!$B$4:$H$53,3,0)=\"Menina\",matIMC!T3,matIMC!T69),\"\")","v":""}]
[63,"",{"$f":"IF(Turma!A$2=1,IF(VLOOKUP(\"x\",Turma!$B$4:$H$53,3,0)=\"Menina\",matIMC!J4,matIMC!J70),\"\")","v":""},{"$f":"IF(Turma!A$2=1,IF(VLOOKUP(\"x\",Turma!$B$4:$H$53,3,0)=\"Menina\",matIMC!L4,matIMC!L70),\"\")","v":""},{"$f":"IF(Turma!A$2=1,IF(VLOOKUP(\"x\",Turma!$B$4:$H$53,3,0)=\"Menina\",matIMC!N4,matIMC!N70),\"\")","v":""},{"$f":"IF(Turma!A$2=1,IF(VLOOKUP(\"x\",Turma!$B$4:$H$53,3,0)=\"Menina\",matIMC!O4,matIMC!O70),\"\")","v":""},{"$f":"IF(Turma!A$2=1,IF(VLOOKUP(\"x\",Turma!$B$4:$H$53,3,0)=\"Menina\",matIMC!P4,matIMC!P70),\"\")","v":""},{"$f":"IF(Turma!A$2=1,IF(VLOOKUP(\"x\",Turma!$B$4:$H$53,3,0)=\"Menina\",matIMC!R4,matIMC!R70),\"\")","v":""},{"$f":"IF(Turma!A$2=1,IF(VLOOKUP(\"x\",Turma!$B$4:$H$53,3,0)=\"Menina\",matIMC!T4,matIMC!T70),\"\")","v":""}]
[64,"",{"$f":"IF(Turma!A$2=1,IF(VLOOKUP(\"x\",Turma!$B$4:$H$53,3,0)=\"Menina\",matIMC!J5,matIMC!J71),\"\")","v":""},{"$f":"IF(Turma!A$2=1,IF(VLOOKUP(\"x\",Turma!$B$4:$H$53,3,0)=\"Menina\",matIMC!L5,matIMC!L71),\"\")","v":""},{"$f":"IF(Turma!A$2=1,IF(VLOOKUP(\"x\",Turma!$B$4:$H$53,3,0)=\"Menina\",matIMC!N5,matIMC!N71),\"\")","v":""},{"$f":"IF(Turma!A$2=1,IF(VLOOKUP(\"x\",Turma!$B$4:$H$53,3,0)=\"Menina\",matIMC!O5,matIMC!O71),\"\")","v":""},{"$f":"IF(Turma!A$2=1,IF(VLOOKUP(\"x\",Turma!$B$4:$H$53,3,0)=\"Menina\",matIMC!P5,matIMC!P71),\"\")","v":""},{"$f":"IF(Turma!A$2=1,IF(VLOOKUP(\"x\",Turma!$B$4:$H$53,3,0)=\"Menina\",matIMC!R5,matIMC!R71),\"\")","v":""},{"$f":"IF(Turma!A$2=1,IF(VLOOKUP(\"x\",Turma!$B$4:$H$53,3,0)=\"Menina\",matIMC!T5,matIMC!T71),\"\")","v":""}]
[65,"",{"$f":"IF(Turma!A$2=1,IF(VLOOKUP(\"x\",Turma!$B$4:$H$53,3,0)=\"Menina\",matIMC!J6,matIMC!J72),\"\")","v":""},{"$f":"IF(Turma!A$2=1,IF(VLOOKUP(\"x\",Turma!$B$4:$H$53,3,0)=\"Menina\",matIMC!L6,matIMC!L72),\"\")","v":""},{"$f":"IF(Turma!A$2=1,IF(VLOOKUP(\"x\",Turma!$B$4:$H$53,3,0)=\"Menina\",matIMC!N6,matIMC!N72),\"\")","v":""},{"$f":"IF(Turma!A$2=1,IF(VLOOKUP(\"x\",Turma!$B$4:$H$53,3,0)=\"Menina\",matIMC!O6,matIMC!O72),\"\")","v":""},{"$f":"IF(Turma!A$2=1,IF(VLOOKUP(\"x\",Turma!$B$4:$H$53,3,0)=\"Menina\",matIMC!P6,matIMC!P72),\"\")","v":""},{"$f":"IF(Turma!A$2=1,IF(VLOOKUP(\"x\",Turma!$B$4:$H$53,3,0)=\"Menina\",matIMC!R6,matIMC!R72),\"\")","v":""},{"$f":"IF(Turma!A$2=1,IF(VLOOKUP(\"x\",Turma!$B$4:$H$53,3,0)=\"Menina\",matIMC!T6,matIMC!T72),\"\")","v":""}]
[66,"",{"$f":"IF(Turma!A$2=1,IF(VLOOKUP(\"x\",Turma!$B$4:$H$53,3,0)=\"Menina\",matIMC!J7,matIMC!J73),\"\")","v":""},{"$f":"IF(Turma!A$2=1,IF(VLOOKUP(\"x\",Turma!$B$4:$H$53,3,0)=\"Menina\",matIMC!L7,matIMC!L73),\"\")","v":""},{"$f":"IF(Turma!A$2=1,IF(VLOOKUP(\"x\",Turma!$B$4:$H$53,3,0)=\"Menina\",matIMC!N7,matIMC!N73),\"\")","v":""},{"$f":"IF(Turma!A$2=1,IF(VLOOKUP(\"x\",Turma!$B$4:$H$53,3,0)=\"Menina\",matIMC!O7,matIMC!O73),\"\")","v":""},{"$f":"IF(Turma!A$2=1,IF(VLOOKUP(\"x\",Turma!$B$4:$H$53,3,0)=\"Menina\",matIMC!P7,matIMC!P73),\"\")","v":""},{"$f":"IF(Turma!A$2=1,IF(VLOOKUP(\"x\",Turma!$B$4:$H$53,3,0)=\"Menina\",matIMC!R7,matIMC!R73),\"\")","v":""},{"$f":"IF(Turma!A$2=1,IF(VLOOKUP(\"x\",Turma!$B$4:$H$53,3,0)=\"Menina\",matIMC!T7,matIMC!T73),\"\")","v":""}]
[67,"",{"$f":"IF(Turma!A$2=1,IF(VLOOKUP(\"x\",Turma!$B$4:$H$53,3,0)=\"Menina\",matIMC!J8,matIMC!J74),\"\")","v":""},{"$f":"IF(Turma!A$2=1,IF(VLOOKUP(\"x\",Turma!$B$4:$H$53,3,0)=\"Menina\",matIMC!L8,matIMC!L74),\"\")","v":""},{"$f":"IF(Turma!A$2=1,IF(VLOOKUP(\"x\",Turma!$B$4:$H$53,3,0)=\"Menina\",matIMC!N8,matIMC!N74),\"\")","v":""},{"$f":"IF(Turma!A$2=1,IF(VLOOKUP(\"x\",Turma!$B$4:$H$53,3,0)=\"Menina\",matIMC!O8,matIMC!O74),\"\")","v":""},{"$f":"IF(Turma!A$2=1,IF(VLOOKUP(\"x\",Turma!$B$4:$H$53,3,0)=\"Menina\",matIMC!P8,matIMC!P74),\"\")","v":""},{"$f":"IF(Turma!A$2=1,IF(VLOOKUP(\"x\",Turma!$B$4:$H$53,3,0)=\"Menina\",matIMC!R8,matIMC!R74),\"\")","v":""},{"$f":"IF(Turma!A$2=1,IF(VLOOKUP(\"x\",Turma!$B$4:$H$53,3,0)=\"Menina\",matIMC!T8,matIMC!T74),\"\")","v":""}]
[68,"",{"$f":"IF(Turma!A$2=1,IF(VLOOKUP(\"x\",Turma!$B$4:$H$53,3,0)=\"Menina\",matIMC!J9,matIMC!J75),\"\")","v":""},{"$f":"IF(Turma!A$2=1,IF(VLOOKUP(\"x\",Turma!$B$4:$H$53,3,0)=\"Menina\",matIMC!L9,matIMC!L75),\"\")","v":""},{"$f":"IF(Turma!A$2=1,IF(VLOOKUP(\"x\",Turma!$B$4:$H$53,3,0)=\"Menina\",matIMC!N9,matIMC!N75),\"\")","v":""},{"$f":"IF(Turma!A$2=1,IF(VLOOKUP(\"x\",Turma!$B$4:$H$53,3,0)=\"Menina\",matIMC!O9,matIMC!O75),\"\")","v":""},{"$f":"IF(Turma!A$2=1,IF(VLOOKUP(\"x\",Turma!$B$4:$H$53,3,0)=\"Menina\",matIMC!P9,matIMC!P75),\"\")","v":""},{"$f":"IF(Turma!A$2=1,IF(VLOOKUP(\"x\",Turma!$B$4:$H$53,3,0)=\"Menina\",matIMC!R9,matIMC!R75),\"\")","v":""},{"$f":"IF(Turma!A$2=1,IF(VLOOKUP(\"x\",Turma!$B$4:$H$53,3,0)=\"Menina\",matIMC!T9,matIMC!T75),\"\")","v":""}]
{"$rows_left_out":59}
{"sheet":"matPeso","index":4,"n_rows":133,"n_cols":22,"rows_kept":133,"cut":false,"hidden":true,"merged":[]}
["idLMS","variavel","genero","meses","L","M","S","P01","P1","P3","P5","P10","P15","P25","P50","P75","P85","P90","P95","P97","P99","P999"]
[1,"peso","menina",61]
[{"$f":"A2+1","v":2},"peso","menina",62]
[{"$f":"A3+1","v":3},"peso","menina",63]
[{"$f":"A4+1","v":4},"peso","menina",64]
[5,"peso","menina",65]
[6,"peso","menina",66]
[7,"peso","menina",67]
[8,"peso","menina",68]
[9,"peso","menina",69]
{"$rows_left_out":124}
{"sheet":"matIMC","index":5,"n_rows":133,"n_cols":22,"rows_kept":133,"cut":false,"hidden":true,"merged":[]}
["idLMS","variavel","genero","meses","L","M","S","P01","P1","P3","P5","P10","P15","P25","P50","P75","P85","P90","P95","P97","P99","P999"]
[1,"peso","menina",61]
[{"$f":"A2+1","v":2},"peso","menina",62]
[{"$f":"A3+1","v":3},"peso","menina",63]
[{"$f":"A4+1","v":4},"peso","menina",64]
[5,"peso","menina",65]
[6,"peso","menina",66]
[7,"peso","menina",67]
[8,"peso","menina",68]
[9,"peso","menina",69]
{"$rows_left_out":123}