{"text_format":"1","workbook":"xlsx","n_sheets":5,"sheets":["Turma","Cardio","Musculo","Motora","percentis"],"not_rendered":{"charts":0,"images":7,"macros":1,"external_links":0,"defined_names":7,"comments":1,"pivot_tables":0},"unopened":[],"bounds":{"document_bytes":16777216,"sheet_cells":100000,"rows_first":2000,"rows_last":500,"rows_between":2000,"halvings":0,"cell_chars":16384,"cell_head_chars":4096},"cells_cut":0,"cells_raw":0,"read":"whole","date_system":"1900"}

{"sheet":"Turma","index":0,"n_rows":53,"n_cols":14,"rows_kept":53,"cut":false,"hidden":false,"merged":[]}
[null,"Ano:",null,null,null,"Média:",{"$f":"IF(COUNTA(G4:G53)>0,AVERAGE(G4:G53),\"\")","v":""},{"$f":"IF(COUNTA(H4:H53)>0,AVERAGE(H4:H53),\"\")","v":""},{"$f":"IF(COUNTA(I4:I53)>0,AVERAGE(I4:I53),\"\")","v":""},"","","","",""]
[{"$f":"COUNTIF(B4:B53,\"x\")","v":0},"Turma:",null,null,null,"Desvio-padrão:",{"$f":"IF(COUNTA(G4:G53)>0,_xlfn.STDEV.P(G4:G53),\"\")","v":""},{"$f":"IF(COUNTA(H4:H53)>0,_xlfn.STDEV.P(H4:H53),\"\")","v":""},"","","","","",""]
["ID Aluno",{"$f":"_xlfn.CONCAT(\"Ver: \",COUNTIF(B4:B53,\"x\"))","v":"Ver: 0"},"Nome","Género","Idade","Data","Corrida/marcha da milha","Corrida vaivém/PACER","Força de preensão","Salto horizontal","Corrida 50 jardas/45.7m","Corrida vaivém/agilidade "]
[1]
[{"$f":"A4+1","v":2}]
[{"$f":"A5+1","v":3}]
[4]
[5]
[6]
[7]
[8]
[9]
[10]
[11]
[12]
[13]
[14]
[15]
[16]
[17]
[18]
[19]
[20]
[21]
[22]
[23]
[24]
[25]
[26]
[27]
[28]
[29]
[30]
[31]
[32]
[33]
[34]
[35]
[36]
[37]
[38]
[39]
[40]
[41]
[42]
[43]
[44]
[45]
[46]
[47]
[48]
[49]
[50]

{"sheet":"Cardio","index":1,"n_rows":50,"n_cols":9,"rows_kept":50,"cut":false,"hidden":false,"merged":[[14,0,14,6],[31,0,31,5],[12,0,12,8]]}
["RELATÓRIO INDIVIDUAL - Aptidão Cardiorrespiratória"]
[{"$f":"IF(Turma!A2=1,VLOOKUP(\"x\",Turma!B$4:H$53,2,0),\"\")","v":""}]
[{"$f":"IF(Turma!A2=1,_xlfn.CONCAT(TEXT(VLOOKUP(\"x\",Turma!B$4:H$53,5,0),\"dd-mm-aaaa\"),\" | \",Turma!C1,\"º ano\",\" | \",Turma!C2),\"\")","v":""}]
[]
[null,"Resultado",null,"Média",null,"Mínimo",null,"Máximo"]
[null,"da criança",null,"da turma",null,"da turma",null,"da turma"]
[{"$f":"Turma!H3 & \" (percursos)\"","v":"Corrida vaivém/PACER (percursos)"},{"$f":"IF(Turma!$A$2=1,VLOOKUP(\"x\",Turma!B4:K53,7,0),0)","v":0},null,{"$f":"IF(AND(Turma!$A$2=1,COUNTA(Turma!$H$4:$H$53)>0),Turma!H1,0)","v":0},null,{"$f":"IF(AND(Turma!$A$2=1,COUNTA(Turma!$H$4:$H$53)>0),SMALL(Turma!H4:H53,1),0)","v":0},null,{"$f":"IF(AND(Turma!$A$2=1,COUNTA(Turma!$H$4:$H$53)>0),LARGE(Turma!H4:H53,1),0)","v":0}]
[]
[]
[]
[]
[]
[]
[]
[]
[]
[]
[]
[]
[]
[]
[]
[]
[]
[]
[]
[]
[]
[]
[]
[]
[]
[]
[]
[]
[]
[]
[]
[]
[]
[]
[]
[]
[]
[]
[]
[]
[]
[]
[null,null,null,null,null,null,null,null,"Este relatório foi gerado a partir de uma aplicação desenvolvida no contexto do projeto REACT financiado pela FCT (https://doi.org/10.54499/PTDC/SAU-DES/2286/2021)"]

{"sheet":"Musculo","index":2,"n_rows":50,"n_cols":9,"rows_kept":50,"cut":false,"hidden":false,"merged":[[12,0,12,8],[14,0,14,6],[31,0,31,5]]}
["RELATÓRIO INDIVIDUAL - Aptidão Musculoesquelética"]
[{"$f":"IF(Turma!A2=1,VLOOKUP(\"x\",Turma!B$4:H$53,2,0),\"\")","v":""}]
[{"$f":"IF(Turma!A2=1,_xlfn.CONCAT(TEXT(VLOOKUP(\"x\",Turma!B$4:H$53,5,0),\"dd-mm-aaaa\"),\" | \",Turma!C1,\"º ano\",\" | \",Turma!C2),\"\")","v":""}]
[]
[null,"Resultado",null,"Média",null,"Mínimo",null,"Máximo"]
[null,"da criança",null,"da turma",null,"da turma",null,"da turma"]
[{"$f":"Turma!I3 & \" (kgf)\"","v":"Força de preensão (kgf)"},{"$f":"IF(Turma!$A$2=1,VLOOKUP(\"x\",Turma!$B$4:$K$53,8,0),0)","v":0},null,{"$f":"IF(AND(Turma!$A$2=1,COUNTA(Turma!$I$4:$I$53)>0),Turma!$I$1,0)","v":0},null,{"$f":"IF(AND(Turma!$A$2=1,COUNTA(Turma!$I$4:$I$53)>0),SMALL(Turma!$I$4:$I$53,1),0)","v":0},null,{"$f":"IF(AND(Turma!$A$2=1,COUNTA(Turma!$I$4:$I$53)>0),LARGE(Turma!$I$4:$I$53,1),0)","v":0}]
[]
[{"$f":"Turma!J3 & \" (centímetros)\"","v":"Salto horizontal (centímetros)"},{"$f":"IF(Turma!$A$2=1,VLOOKUP(\"x\",Turma!$B$4:$K$53,9,0),0)","v":0},null,{"$f":"IF(AND(Turma!$A$2=1,COUNTA(Turma!$J$4:$J$53)>0),Turma!$J$1,0)","v":0},null,{"$f":"IF(AND(Turma!$A$2=1,COUNTA(Turma!$J$4:$J$53)>0),SMALL(Turma!$J$4:$J$53,1),0)","v":0},null,{"$f":"IF(AND(Turma!$A$2=1,COUNTA(Turma!$J$4:$J$53)>0),LARGE(Turma!$J$4:$J$53,1),0)","v":0}]
[]
[]
[]
[]
[]
[]
[]
[]
[]
[]
[]
[]
[]
[]
[]
[]
[]
[]
[]
[]
[]
[]
[]
[]
[]
[]
[]
[]
[]
[]
[]
[]
[]
[]
[]
[]
[]
[]
[]
[]
[null,null,null,null,null,null,null,null,"Este relatório foi gerado a partir de uma aplicação desenvolvida no contexto do projeto REACT financiado pela FCT (https://doi.org/10.54499/PTDC/SAU-DES/2286/2021)"]

{"sheet":"Motora","index":3,"n_rows":50,"n_cols":9,"rows_kept":50,"cut":false,"hidden":false,"merged":[[12,0,12,8],[14,0,14,6],[31,0,31,5]]}
["RELATÓRIO INDIVIDUAL - Aptidão Motora"]
[{"$f":"IF(Turma!A2=1,VLOOKUP(\"x\",Turma!B$4:H$53,2,0),\"\")","v":""}]
[{"$f":"IF(Turma!A2=1,_xlfn.CONCAT(TEXT(VLOOKUP(\"x\",Turma!B$4:H$53,5,0),\"dd-mm-aaaa\"),\" | \",Turma!C1,\"º ano\",\" | \",Turma!C2),\"\")","v":""}]
[]
[null,"Resultado",null,"Média",null,"Mínimo",null,"Máximo"]
[null,"da criança",null,"da turma",null,"da turma",null,"da turma"]
[{"$f":"Turma!K3 & \" (segundos)\"","v":"Corrida 50 jardas/45.7m (segundos)"},{"$f":"IF(Turma!$A$2=1,VLOOKUP(\"x\",Turma!$B$4:$K$53,10,0),0)","v":0},null,{"$f":"IF(AND(Turma!$A$2=1,COUNTA(Turma!$K$4:$K$53)>0),Turma!$K$1,0)","v":0},null,{"$f":"IF(AND(Turma!$A$2=1,COUNTA(Turma!$K$4:$K$53)>0),SMALL(Turma!$K$4:$K$53,1),0)","v":0},null,{"$f":"IF(AND(Turma!$A$2=1,COUNTA(Turma!$K$4:$K$53)>0),LARGE(Turma!$K$4:$K$53,1),0)","v":0}]
[]
[{"$f":"Turma!L3 & \" (segundos)\"","v":"Corrida vaivém/agilidade  (segundos)"},{"$f":"IF(Turma!$A$2=1,VLOOKUP(\"x\",Turma!$B$4:$L$53,11,0),0)","v":0},null,{"$f":"IF(AND(Turma!$A$2=1,COUNTA(Turma!$L$4:$L$53)>0),Turma!$L$1,0)","v":0},null,{"$f":"IF(AND(Turma!$A$2=1,COUNTA(Turma!$L$4:$L$53)>0),SMALL(Turma!$L$4:$L$53,1),0)","v":0},null,{"$f":"IF(AND(Turma!$A$2=1,COUNTA(Turma!$L$4:$L$53)>0),LARGE(Turma!$L$4:$L$53,1),0)","v":0}]
[]
[]
[]
[]
[]
[]
[]
[]
[]
[]
[]
[]
[]
[]
[]
[]
[]
[]
[]
[]
[]
[]
[]
[]
[]
[]
[]
[]
[]
[]
[]
[]
[]
[]
[]
[]
[]
[]
[]
[]
[null,null,null,null,null,null,null,null,"Este relatório foi gerado a partir de uma aplicação desenvolvida no contexto do projeto REACT financiado pela FCT (https://doi.org/10.54499/PTDC/SAU-DES/2286/2021)"]

{"sheet":"percentis","index":4,"n_rows":93,"n_cols":19,"rows_kept":93,"cut":false,"hidden":true,"merged":[]}
["Criança seleccionada",null,null,"Género",{"$f":"IF(Turma!$A$2=1,VLOOKUP(\"x\",Turma!B4:K53,3,0),0)","v":0},null,"Anos:",{"$f":"IF(Turma!$A$2=1,VLOOKUP(\"x\",Turma!B4:K53,4,0),0)","v":0}]
[]
["Meninas","Meses","p3","p10","p25","p50","p75","p90","p97",null,"Meninos","Meses","p3","p10","p25","p50","p75","p90","p97"]
["pacer",72,3.757511,4.9924600000000003,6.6388170000000004,8.8354900000000001,11.76892,15.68956,20.934149999999999,null,"pacer",72,4.2819570000000002,5.4174620000000004,7.0118,9.3295560000000002,12.846109999999999,18.476680000000002,28.145710000000001]
[null,78,4.0196620000000003,5.3823410000000003,7.2096359999999997,9.6608730000000005,12.950329999999999,17.36628,23.29673,null,null,78,4.624263,5.9522190000000004,7.8255990000000004,10.549849999999999,14.657629999999999,21.130549999999999,31.904070000000001]
["valor:",84,4.2848870000000003,5.7840999999999996,7.80661,10.53463,14.21369,19.17454,25.862670000000001,null,"valor:",84,4.9743019999999998,6.5277599999999998,8.7293179999999992,11.92891,16.7163,24.127510000000001,36.07302]
[{"$f":"IF(Turma!$A$2=1, IF(VLOOKUP(\"x\",Turma!$B$4:$K$53,3,0)=\"Menina\",VLOOKUP(\"x\",Turma!$B$4:$K$53,7,0),0),  0)","v":0},90,4.5285659999999996,6.1628449999999999,8.3806999999999992,11.38832,15.463939999999999,20.98283,28.450679999999998,null,{"$f":"IF(Turma!$A$2=1, IF(VLOOKUP(\"x\",Turma!$B$4:$K$53,3,0)=\"Menino\",VLOOKUP(\"x\",Turma!$B$4:$K$53,7,0),0),  0)","v":0},90,5.3381129999999999,7.1602180000000004,9.7540569999999995,13.51801,19.098030000000001,27.571380000000001,40.792209999999997]
[null,96,4.7473280000000004,6.5127639999999998,8.9225589999999997,12.2075,16.679449999999999,22.759360000000001,31.014600000000002,null,null,96,5.6373980000000001,7.7533960000000004,10.77885,15.15812,21.581029999999998,31.135400000000001,45.566029999999998]
[null,102,4.944,6.836989,9.4356089999999995,12.995839999999999,17.86403,24.507850000000001,33.55771,null,null,102,5.8307440000000001,8.2551020000000008,11.73657,16.75808,24.033560000000001,34.623440000000002,50.110689999999998]
[null,108,5.1287029999999998,7.1500659999999998,9.9406960000000009,13.783110000000001,19.059909999999999,26.28792,36.163580000000003,null,null,108,5.8998100000000004,8.6416649999999997,12.59634,18.273910000000001,26.388249999999999,37.934170000000002,54.292400000000001]
[null,114,5.3075400000000004,7.4613149999999999,10.45191,14.590350000000001,20.29815,28.144770000000001,38.897239999999996,null,null,114,5.844449,8.9143519999999992,13.36204,19.71022,28.64686,41.067830000000001,58.128309999999999]
[null,120,5.4755330000000004,7.7632370000000002,10.95823,15.40165,21.556059999999999,30.046330000000001,41.713450000000002,null,null,120,5.6655160000000002,9.0768850000000008,14.042479999999999,21.079460000000001,30.823139999999999,44.04327,61.661470000000001]
[null,126,5.6279680000000001,8.0482209999999998,11.44786,16.199200000000001,22.80725,31.95401,44.556460000000001,null,null,126,5.3682480000000004,9.1422980000000003,14.663600000000001,22.421430000000001,32.971739999999997,46.938549999999999,65.015159999999995]
[]
[]
[]
[]
[]
[]
[]
[]
[]
["Meninas","Meses","P3","p10","p25","p50","p75","p90","p97",null,"Meninos","Meses","p3","p10","p25","p50","p75","p90","p97"]
["fpreensao",72,4.8696919999999997,5.9180169999999999,7.0258560000000001,8.1892910000000008,9.4050440000000002,10.67032,11.982699999999999,null,"fpreensao",72,5.2325189999999999,6.1691229999999999,7.2538929999999997,8.5072949999999992,9.9522180000000002,11.614229999999999,13.52182]
[null,78,5.3120880000000001,6.4249330000000002,7.6069769999999997,8.8545010000000008,10.164339999999999,11.53373,12.960290000000001,null,null,78,5.6897739999999999,6.7197310000000003,7.8989799999999999,9.2440879999999996,10.772930000000001,12.504770000000001,14.46027]
["valor:",84,5.7770929999999998,6.9548170000000002,8.2120719999999992,9.5455550000000002,10.952389999999999,12.43005,13.976279999999999,null,"valor:",84,6.1596650000000004,7.2864620000000002,8.5615950000000005,9.9976050000000001,11.60755,13.405010000000001,15.404070000000001]
[{"$f":"IF(Turma!$A$2=1, IF(VLOOKUP(\"x\",Turma!$B$4:$K$53,3,0)=\"Menina\",VLOOKUP(\"x\",Turma!$B$4:$K$53,8,0),0),  0)","v":0},90,6.2804060000000002,7.52555,8.8614999999999995,10.28561,11.79555,13.38921,15.06471,null,{"$f":"IF(Turma!$A$2=1, IF(VLOOKUP(\"x\",Turma!$B$4:$K$53,3,0)=\"Menino\",VLOOKUP(\"x\",Turma!$B$4:$K$53,8,0),0),  0)","v":0},90,6.6520200000000003,7.8807530000000003,9.2548539999999999,10.78288,12.473420000000001,14.33512,16.376660000000001]
[null,96,6.8305040000000004,8.1463730000000005,9.5654210000000006,11.085979999999999,12.706530000000001,14.425700000000001,16.24222,null,null,96,7.1527729999999998,8.4857089999999999,9.9585589999999993,11.57606,13.34282,15.263299999999999,17.34188]
[null,102,7.4082809999999997,8.7947100000000002,10.2974,11.915979999999999,13.650119999999999,15.49949,17.463799999999999,null,null,102,7.6592520000000004,9.0978139999999996,10.668229999999999,12.37176,14.20961,16.18291,18.29271]
[null,108,8.0119439999999997,9.468375,11.05477,12.77242,14.622529999999999,16.606259999999999,18.724679999999999,null,null,108,8.1716560000000005,9.7168969999999995,11.383279999999999,13.16915,15.07297,17.09337,19.22908]
[null,114,8.6470819999999993,10.17376,11.84477,13.66344,15.632960000000001,17.756409999999999,20.036760000000001,null,null,114,8.6906890000000008,10.34333,12.10378,13.968120000000001,15.93291,17.995069999999998,20.15185]
[null,120,9.3038340000000002,10.89963,12.654540000000001,14.57429,16.6645,18.930689999999998,21.378240000000002,null,null,120,9.2113809999999994,10.970660000000001,12.821770000000001,14.75939,16.778949999999998,18.876529999999999,21.048680000000001]
[null,126,9.9794219999999996,11.64298,13.48072,15.501139999999999,17.71274,20.123999999999999,22.743390000000002,null,null,126,9.7361900000000006,11.60122,13.5396,15.54555,17.614260000000002,19.741710000000001,21.924440000000001]
[]
[]
[]
[]
[]
[]
[]
[]
[]
["Meninas","Meses","p3","p10","p25","p50","p75","p90","p97",null,"Meninos","Meses","p3","p10","p25","p50","p75","p90","p97"]
["shorizontal",72,58.046979999999998,69.035640000000001,79.752619999999993,90.245350000000002,100.5478,110.68519999999999,120.67749999999999,null,"shorizontal",72,65.803439999999995,78.176900000000003,90.043610000000001,101.50360000000001,112.62569999999999,123.4601,134.04499999999999]
[null,78,60.870699999999999,71.950749999999999,82.873369999999994,93.663039999999995,104.3378,114.9117,125.3954,null,null,78,68.196960000000004,81.020480000000006,93.318830000000005,105.1956,116.7223,127.9508,138.92070000000001]
["valor:",84,63.888260000000002,75.072590000000005,86.214070000000007,97.318520000000007,108.3904,119.4332,130.44970000000001,null,"valor:",84,70.590490000000003,83.864080000000001,96.594070000000002,108.8877,120.8189,132.44159999999999,143.79640000000001]
[{"$f":"IF(Turma!$A$2=1, IF(VLOOKUP(\"x\",Turma!$B$4:$K$53,3,0)=\"Menina\",VLOOKUP(\"x\",Turma!$B$4:$K$53,9,0),0),  0)","v":0},90,67.230189999999993,78.544179999999997,89.932450000000003,101.38630000000001,112.8991,124.46510000000001,136.07990000000001,null,{"$f":"IF(Turma!$A$2=1, IF(VLOOKUP(\"x\",Turma!$B$4:$K$53,3,0)=\"Menino\",VLOOKUP(\"x\",Turma!$B$4:$K$53,9,0),0),  0)","v":0},90,72.984020000000001,86.707679999999996,99.869309999999999,112.57980000000001,124.9156,136.9323,148.6722]
[null,96,70.756420000000006,82.211169999999996,93.856930000000006,105.6752,117.651,129.77189999999999,142.02719999999999,null,null,96,75.377539999999996,89.551270000000002,103.14449999999999,116.2719,129.01220000000001,141.423,153.5479]
[null,102,74.090190000000007,85.662080000000003,97.53407,109.6827,122.0882,134.73390000000001,147.6054,null,null,102,77.771060000000006,92.394869999999997,106.4198,119.9639,133.1088,145.91370000000001,158.42359999999999]
[null,108,77.176609999999997,88.842190000000002,100.9079,113.3492,126.1451,139.27699999999999,152.72900000000001,null,null,108,80.164590000000004,95.238460000000003,109.69499999999999,123.65600000000001,137.2054,150.40440000000001,163.29939999999999]
[null,114,79.993600000000001,91.731200000000001,103.95959999999999,116.6562,129.8014,143.3775,157.3689,null,null,114,82.558109999999999,98.082049999999995,112.97020000000001,127.3481,141.3021,154.89519999999999,168.17509999999999]
[null,120,82.568889999999996,94.360640000000004,106.72539999999999,119.6452,133.1036,147.08619999999999,161.57929999999999,null,null,120,84.951639999999998,100.92570000000001,116.24550000000001,131.0402,145.39869999999999,159.38589999999999,173.05080000000001]
[null,126,85.050979999999996,96.889210000000006,109.37820000000001,122.50620000000001,136.2627,150.6377,165.6223,null,null,126,87.345160000000007,103.7692,119.52070000000001,134.73220000000001,149.49529999999999,163.8766,177.9265]
[]
[]
[]
[]
[]
[]
[]
[]
[]
["Meninas","Meses","p97","p90","p75","p50","p25","p10","p3",null,"Meninos","Meses","p97","p90","p75","p50","p25","p10","p3"]
["velocidade",72,9.4197240000000004,9.9266279999999991,10.50794,11.182829999999999,11.978020000000001,12.93196,14.102349999999999,null,"velocidade",72,8.9878979999999995,9.4839269999999996,10.05598,10.724690000000001,11.519310000000001,12.482839999999999,13.68154]
[null,78,9.1403750000000006,9.6320099999999993,10.19693,10.85444,11.63161,12.567780000000001,13.722670000000001,null,null,78,8.7258030000000009,9.2071050000000003,9.7625349999999997,10.41236,11.185359999999999,12.124000000000001,13.29396]
["valor:",84,8.8737359999999992,9.3507829999999998,9.9000090000000007,10.54082,11.30063,12.21964,13.35957,null,"valor:",84,8.4571900000000007,8.9234200000000001,9.4618079999999996,10.092219999999999,10.84294,11.75582,12.89587]
[{"$f":"IF(Turma!$A$2=1, IF(VLOOKUP(\"x\",Turma!$B$4:$K$53,3,0)=\"Menina\",VLOOKUP(\"x\",Turma!$B$4:$K$53,10,0),0),  0)","v":0},90,8.6287749999999992,9.0924069999999997,9.6271810000000002,10.25259,10.99638,11.89959,13.0259,null,{"$f":"IF(Turma!$A$2=1, IF(VLOOKUP(\"x\",Turma!$B$4:$K$53,3,0)=\"Menino\",VLOOKUP(\"x\",Turma!$B$4:$K$53,10,0),0),  0)","v":0},90,8.1910290000000003,8.6423410000000001,9.1638380000000002,9.7749699999999997,10.503500000000001,11.390639999999999,12.50066]
[null,96,8.4034960000000005,8.8547849999999997,9.3762299999999996,9.987406,10.71635,11.604889999999999,12.71861,null,null,96,7.955559,8.3936799999999998,8.9002300000000005,9.4942949999999993,10.20317,11.067500000000001,12.15089]
[null,102,8.2013789999999993,8.6415849999999992,9.1510440000000006,9.7493990000000004,10.46496,11.34027,12.442740000000001,null,null,102,7.760192,8.1873649999999998,8.6815149999999992,9.2614190000000001,9.9539950000000008,10.79942,11.860760000000001]
[null,108,8.0162750000000003,8.4463290000000004,8.9447829999999993,9.5313339999999993,10.234529999999999,11.09759,12.189629999999999,null,null,108,7.6036650000000003,8.0220629999999993,8.5062770000000008,9.0748409999999993,9.7543729999999993,10.584680000000001,11.628450000000001]
[null,114,7.8431699999999998,8.2637280000000004,8.7518630000000002,9.3273119999999992,10.018829999999999,10.87026,11.95237,null,null,114,7.4700329999999999,7.880941,8.3566699999999994,8.9155510000000007,9.5839409999999994,10.401339999999999,11.43009]
[null,120,7.6822660000000003,8.0939949999999996,8.5725180000000005,9.1376050000000006,9.818206,10.65874,11.731540000000001,null,null,120,7.3467960000000003,7.7507999999999999,8.2187049999999999,8.7686469999999996,9.4267439999999993,10.232200000000001,11.247059999999999]
[null,126,7.5290600000000003,7.9323810000000003,8.4017339999999994,8.9569120000000009,9.6270450000000007,10.45711,11.52098,null,null,126,7.2255370000000001,7.6227499999999999,8.0829550000000001,8.6240930000000002,9.2720389999999995,10.065709999999999,11.066789999999999]
[]
[]
[]
[]
[]
[]
[]
[]
[]
["Meninas","Meses","p97","p90","p75","p50","p25","p10","p3",null,"Meninos","Meses","p97","p90","p75","p50","p25","p10","p3"]
["agilidade",72,12.384650000000001,12.990629999999999,13.659750000000001,14.40249,15.23175,16.16367,17.21866,null,"agilidade",72,11.74802,12.343529999999999,13.0204,13.79799,14.70261,15.771039999999999,17.056480000000001]
[null,78,12.09019,12.6694,13.31147,14.0275,14.83142,15.740919999999999,16.778860000000002,null,null,78,11.496790000000001,12.06434,12.709949999999999,13.45252,14.317869999999999,15.3424,16.579270000000001]
["valor:",84,11.79693,12.35046,12.966379999999999,13.65638,14.435320000000001,15.32244,16.343129999999999,null,"valor:",84,11.22729,11.76685,12.38105,13.088229999999999,13.91361,14.892989999999999,16.079149999999998]
[{"$f":"IF(Turma!$A$2=1, IF(VLOOKUP(\"x\",Turma!$B$4:$K$53,3,0)=\"Menina\",VLOOKUP(\"x\",Turma!$B$4:$L$53,11,0),0),  0)","v":0},90,11.51552,12.04491,12.636100000000001,13.301299999999999,14.056319999999999,14.92191,15.92605,null,{"$f":"IF(Turma!$A$2=1, IF(VLOOKUP(\"x\",Turma!$B$4:$K$53,3,0)=\"Menino\",VLOOKUP(\"x\",Turma!$B$4:$L$53,11,0),0),  0)","v":0},90,10.94839,11.460710000000001,12.044230000000001,12.71668,13.50258,14.43694,15.571859999999999]
[null,96,11.25569,11.76281,12.331110000000001,12.9733,13.706049999999999,14.551690000000001,15.54087,null,null,96,10.70101,11.189539999999999,11.7462,12.38813,13.13916,14.03351,15.12243]
[null,102,11.022819999999999,11.5097,12.057130000000001,12.67831,13.3908,14.218450000000001,15.194750000000001,null,null,102,10.49671,10.96557,11.49995,12.116490000000001,12.8384,13.69913,14.749129999999999]
[null,108,10.81432,11.282730000000001,11.8111,12.413080000000001,13.10707,13.918519999999999,14.883839999999999,null,null,108,10.324070000000001,10.776400000000001,11.29203,11.88716,12.5844,13.41653,14.433160000000001]
[null,114,10.624840000000001,11.07625,11.587020000000001,12.171250000000001,12.84815,13.64476,14.60055,null,null,114,10.16902,10.606780000000001,11.10585,11.68201,12.357340000000001,13.163930000000001,14.15057]
[null,120,10.4466,10.882070000000001,11.376289999999999,11.94373,12.60441,13.38697,14.33403,null,null,120,10.024330000000001,10.44876,10.93267,11.49142,12.146570000000001,12.929539999999999,13.88827]
[null,126,10.2706,10.690770000000001,11.168990000000001,11.72011,12.364879999999999,13.13349,14.07178,null,null,126,9.8824919999999992,10.29415,10.76351,11.30552,11.94122,12.70134,13.632899999999999]